آینه هلالی
type: Concept
broader: آینه
preferred label: meniscus mirror @en
scope note: آینۀ یکپارچه و نازکی که شامل یک سطح کوژ و یک سطح کاو با انحنای یکسان است.

آینه
type: Concept
narrower: آینه هلالی
preferred label: mirror @en