تلسکوپ بازتابی
type: Concept
preferred label: reflecting telescope @en
related: آینه ثانویه

آینه ثانویه
type: Concept
broader: آینه
preferred label: secondary mirror @en
related: تلسکوپ بازتابی
scope note: دومین آینه در مسیر پرتوهای نور در تلسکوپ‌های بازتابی

آینه
type: Concept
narrower: آینه ثانویه
preferred label: mirror @en