پراش پودری
type: Concept
preferred label: powder diffraction @en
related: دوربین پراش پودری

دوربین پراش پودری
type: Concept
broader: افزاره نوری
preferred label: powder diffraction camera @en
related: پراش پودری
scope note: استوانه‌ای توخالی با آستری از فیلم (film) حساس که در آن باریکه‌ای از پرتوهای ایکس تکفام بر نمونه‌ای از بلور در امتداد محور استوانه تابیده می‌شود و نقش پراش حاصل بر روی فیلم ثبت می‌شود.

افزاره نوری
type: Concept
narrower: دوربین پراش پودری
preferred label: optical device @en