هواگرد
type: Concept
preferred label: aircraft @en
related: چتر پایدارساز

چتر پایدارساز
type: Concept
broader: چتر
preferred label: stabilising parachute @en
related: هواگرد
scope note: چتری برای حفظ تعادل بار پس از پایین انداختن آن از هواگرد

چتر
type: Concept
narrower: چتر پایدارساز
preferred label: parachute @en