برخورددهنده خطی
type: Concept
broader: برخورددهنده
preferred label: linear collider @en
scope note: شتاب‌دهنده‌ای خطی که در آن دو باریکۀ ذرات باردار در خلاف جهت یکدیگر شتاب می‌گیرند و با هم برخورد می‌کنند.

برخورددهنده
type: Concept
narrower: برخورددهنده خطی
preferred label: collider @en