تلمبه واشویه
type: Concept
broader: تلمبه
preferred label: backwash pump @en
scope note: تلمبه‌ای برای انتقال آب واشویه به داخل صافی

تلمبه
type: Concept
narrower: تلمبه واشویه
preferred label: pump @en