ریل بلند
type: Concept
broader: ریل
preferred label: long rail @en
scope note: نوعی ریل که طول آن بیش از طول ریل استاندارد است و در خطوط سریع‌السیر به کار می‌رود.

ریل
type: Concept
narrower: ریل بلند
preferred label: rail @en