پایه ریل
type: Concept
broader: ریل
preferred label: rail foot @en
scope note: قسمت پایین ریل که در حالت افقی قرار دارد و تکیه‌گاه ریل است.

ریل
type: Concept
narrower: پایه ریل
preferred label: rail @en