ریل پهلویی
type: Concept
broader: ریل
preferred label: stock rail @en
scope note: ریل ممتد و مستقیم سوزن که تیغۀ سوزن در دو حالت متفاوت با آن جفت می‌شود یا از آن فاصله می‌گیرد.

ریل
type: Concept
narrower: ریل پهلویی
preferred label: rail @en