ریل سوم زیرتماس
type: Concept
broader: ریل سوم
preferred label: underrunning third rail @en
scope note: ریل سومی که در آن سطح اتصال الکتریکی رو به ‌پایین قرار دارد.

ریل سوم
type: Concept
narrower: ریل سوم زیرتماس
preferred label: third rail @en