پس‌ریل
type: Concept
broader: ریل
preferred label: trailing rail @en
scope note: یکی از ریل‌های دو طرف درز اتصال که با توجه به جهت قراردادی عبور قطارها از خط، قبل از پیش‌ریل قرار می‌گیرد.

ریل
type: Concept
narrower: پس‌ریل
preferred label: rail @en