صندلی تاشو
type: Concept
broader: صندلی
preferred label: jump seat @en
scope note: صندلی‌ای در اتاقک خلبان که خدمۀ پرواز از آن استفاده نمی‌کنند، اما سایر خدمۀ مجاز هواگَرد می‌توانند آن را اشغال کنند.

صندلی
type: Concept
narrower: صندلی تاشو
preferred label: seat @en