خشک‌کن نقاله‌ای هم‌سو
type: Concept
broader: خشک‌کن نقاله‌ای
preferred label: concurrent conveyor dryer @en
scope note: نوعی خشک‌کن نقاله‌ای که در آن جهت حرکت تسمه‌نقالۀ حاوی مواد غذایی همسو با جریان هوای گرم است.

خشک‌کن نقاله‌ای
type: Concept
narrower: خشک‌کن نقاله‌ای هم‌سو
preferred label: conveyor dryer @en