خشک‌کن تک‌نقاله‌ای
type: Concept
broader: خشک‌کن نقاله‌ای
preferred label: single belt dryer @en
scope note: نوعی خشک‌کن نقاله‌ای که یک تسمه‌نقاله دارد.

خشک‌کن نقاله‌ای
type: Concept
narrower: خشک‌کن تک‌نقاله‌ای
preferred label: conveyor dryer @en