خشک‌کن دوغلتکی
type: Concept
broader: خشک‌کن غلتکی
preferred label: double drum dryer @en
scope note: نوعی خشک‌کن غلتکی، با دو غلتک ‌نزدیک‌به‌هم که در جهت هم می‌چرخند و فاصلۀ بین آنها ضخامت لایۀ مواد غذایی بر روی سطح غلتک را مهار می‌کند.

خشک‌کن غلتکی
type: Concept
narrower: خشک‌کن دوغلتکی
preferred label: drum dryer @en