خشک‌کن افشانه‌ای ناهم‌سو
type: Concept
broader: خشک‌کن افشانه‌ای
preferred label: countercurrent flow spray dryer @en
scope note: نوعی خشک‌کن افشانه‌ای که در آن جهت جریان هوای داغ در خلاف جهت افشانش مواد غذایی است.

خشک‌کن افشانه‌ای
type: Concept
narrower: خشک‌کن افشانه‌ای ناهم‌سو
preferred label: spray dryer @en