خشک‌کن تونلی هم‌سو
type: Concept
broader: خشک‌کن تونلی
preferred label: concurrent tunnel dryer @en
scope note: نوعی خشک‌کن تونلی که در آن جریان هوای گرم همسو با جهت حرکت مواد غذایی است.

خشک‌کن تونلی
type: Concept
narrower: خشک‌کن تونلی هم‌سو
preferred label: tunnel dryer @en