گازشوی ونتوری
type: Concept
broader: گازشو
preferred label: Venturi scrubber @en
scope note: دستگاهی که در آن گاز از گلوگاه یا ونتوری که مایع شست‌وشودهنده در آن تزریق شده است عبور می‌کند.

گازشو
type: Concept
narrower: گازشوی ونتوری
preferred label: wet scrubber @en