خودسپری
type: Concept
broader: سپرگذاری
preferred label: self-shielding @en
scope note: حفاظت از بخش درونی سوخت هسته‌ای با استفاده از بخش بیرونی آن

سپرگذاری
type: Concept
narrower: خودسپری
preferred label: shielding @en