لنگر خیشی
type: Concept
broader: لنگر
preferred label: plow anchor @en
scope note: نوعی لنگر دارای پنجۀ خیشی که مناسب بسترهای ماسه‌ای و گِلی است.

لنگر
type: Concept
narrower: لنگر خیشی
preferred label: anchor @en