آب سالم
type: Concept
broader: آب
preferred label: safe water @en
related: سلامت
scope note: آب عاری از مواد سمی و باکتری‌ها و مواد شیمیایی که آشامیدن آن برای سلامتی مضر نباشد، هرچند دارای طعم و بو و رنگ و برخی مواد معدنی باشد.

آب
type: Concept
narrower: آب سالم
preferred label: water @en

سلامت
type: Concept
preferred label: health @en
related: آب سالم