فرودراه نظامی
type: Concept
broader: فرودگاه نظامی
preferred label: military landing zone @en
scope note: باریکه‌ای برای فرود هواگَرد که منحصراً برای آموزش نیروهای نظامی به کار گرفته می‌شود.

فرودگاه نظامی
type: Concept
narrower: فرودراه نظامی
preferred label: military airport @en