واکنشگاه حالت‌پایا
type: Concept
alternative label: رآکتور حالت‌پایا
broader: واکنشگاه هسته‌ای
preferred label: steady-state reactor @en
scope note: هر واکنشگاه/ رآکتور هسته‌ای که وضعیت کارکرد آن در طول زمان چندان تغییری ندارد.

واکنشگاه هسته‌ای
type: Concept
narrower: واکنشگاه حالت‌پایا
preferred label: nuclear reactor @en