واکنشگاه آب سبک
type: Concept
alternative label: رآکتور آب سبک
broader: واکنشگاه خنک‌شده با آب
preferred label: light water reactor @en
scope note: واکنشگاه/ رآکتوری هسته‌ای که در آن از آب سبک به‌عنوان کندساز و خنک‌کننده استفاده می‌شود.

واکنشگاه خنک‌شده با آب
type: Concept
narrower: واکنشگاه آب سبک
preferred label: water cooled reactor @en