بارگنج
type: Concept
preferred label: container @en
related: فرستگاه بارگنج

فرستگاه بارگنج
type: Concept
broader: پایانه بارگنج
preferred label: container freight station @en
related: بارگنج
scope note: محل استقرار و باربندی و بارگشایی بارگُنج‌ها و انجام امور اداری و اجرایی مربوط به ارسال یا تحویل آنها

پایانه بارگنج
type: Concept
narrower: فرستگاه بارگنج
preferred label: container terminal @en