شکست بلورین
type: Concept
broader: شکست
preferred label: crystalline fracture @en
scope note: شکستی در فلزات چندبلوری با سطح‌شکستی ناصاف و خشن

شکست
type: Concept
narrower: شکست بلورین
preferred label: fracture @en