شکست دانه‌ای
type: Concept
broader: شکست
preferred label: granular fracture @en
scope note: شکستی در فلزات با سطح‌شکستی خشن و دانه‌ای‌شکل

شکست
type: Concept
narrower: شکست دانه‌ای
preferred label: fracture @en