شکست ریزبافت
type: Concept
broader: شکست
preferred label: silky fracture @en
scope note: شکستی در فلزات که در آن سطح‌شکست معمولاً مات و کدر است و بافتی ظریف دارد.

شکست
type: Concept
narrower: شکست ریزبافت
preferred label: fracture @en