شکست مایل
type: Concept
broader: شکست
preferred label: slant fracture @en
scope note: شکستی از نوع شکست‌های تحت تنش صفحه‌ای که در آن صفحۀ جدایش فلز نسبت به محورِ اِعمالِ تنش مایل است.

شکست
type: Concept
narrower: شکست مایل
preferred label: fracture @en