شکست ترا‌دانه‌ای
type: Concept
broader: شکست
preferred label: transgranular fracture @en
scope note: گسترش ترک از میان دانه‌ها یا بلورهای فلز یا آلیاژ

شکست
type: Concept
narrower: شکست ترا‌دانه‌ای
preferred label: fracture @en