بودجه‌بندی
type: Concept
broader: امور مالی
preferred label: cost budgeting @en
scope note: جمع‌بندی هزینه‌های برآوردشدۀ فعالیت‌های منفرد یا بسته‌های کاری (work package) برای تعیین بودجۀ مبنا

امور مالی
type: Concept
narrower: بودجه‌بندی
preferred label: finance @en