گذرانه
type: Concept
broader: دستمزد و هزینه
preferred label: transit charge @en
scope note: عوارضی که از وسایل نقلیه برای عبور از کشوری به کشور دیگر دریافت شود.

دستمزد و هزینه
type: Concept
narrower: گذرانه
preferred label: fees and charge @en