نقشه‌سازی رویشگاه
type: Concept
broader: نقشه‌سازی
preferred label: site mapping @en
scope note: ترسیم رویشگاه‌های طبیعی یک جنگل بر روی نقشه پس از شناسایی و برداشت

نقشه‌سازی
type: Concept
narrower: نقشه‌سازی رویشگاه
preferred label: mapping @en