سلامت اجتماعی
type: Concept
broader: سلامت
preferred label: social health @en
scope note: توانایی فرد در ایجاد ارتباط با محیط اجتماعی

سلامت
type: Concept
narrower: سلامت اجتماعی
preferred label: health @en