تاب‌کاری کم‌دما
type: Concept
broader: تاب‌کاری شیشه
preferred label: blue annealing @en

تاب‌کاری شیشه
type: Concept
broader: تاب‌کاری
narrower: تاب‌کاری کم‌دما
preferred label: glass annealing @en
scope note: فرایند گرمایش و سرمایش، به‌ویژه سرمایش، ظروف شیشه‌ای تحت برنامه‌ای مشخص برای کاهش تنش‌های حرارتی و شکنندگی جسم

تاب‌کاری
type: Concept
narrower: تاب‌کاری شیشه
preferred label: annealing @en