کربن
type: Concept
preferred label: carbon @en
related: کربن‌زدایی

کربن‌زدایی
type: Concept
broader: عملیات حرارتی
preferred label: decarburization @en
related: کربن
scope note: زدودن کربن از لایۀ سطحی آلیاژ کربن‌دار در جریان کار گرم (hot working) یا حرارت‌دهی مجدد ازطریق تماس‌ دادن سطح آلیاژ با یک یا چند مادۀ شیمیایی و واکنشی که در پی دارد.

عملیات حرارتی
type: Concept
narrower: کربن‌زدایی
preferred label: heat treatment @en