سردایش هواراند
type: Concept
broader: سردایش
preferred label: forced-air quenching @en
scope note: سرد کردن سریع قطعات کوچک فولاد آلیاژی با دمیدن هوای فشرده

سردایش
type: Concept
narrower: سردایش هواراند
preferred label: quenching @en