سردایش افشانه‌ای
type: Concept
broader: سردایش
preferred label: spray quenching @en
scope note: نوعی سرد کردن که در آن با افشانه آب یا روغن را مستقیماً بر روی قطعۀ گرم می‌پاشند.

سردایش
type: Concept
narrower: سردایش افشانه‌ای
preferred label: quenching @en