فن بازپخت مهره‌ای
type: Concept
broader: بازپخت
preferred label: temper bead technique @en
scope note: روشی که در آن جوش لایۀ رویی موجب پخت مجدد و اصلاح خواص متالورژیکی لایۀ زیرین می‌شود.

بازپخت
type: Concept
narrower: فن بازپخت مهره‌ای
preferred label: tempering @en