عملیات گرماشیمیایی
type: Concept
broader: عملیات حرارتی
preferred label: thermochemical treatment @en
scope note: عملیات حرارتی در یک محیط واسطۀ مناسب برای ایجاد تغییر در ترکیب شیمیایی قطعه به‌کمک تبادل گرما با محیط واسطه

عملیات حرارتی
type: Concept
narrower: عملیات گرماشیمیایی
preferred label: heat treatment @en