تصویربرداری درون‌چاهی
type: Concept
broader: فن تصویربرداری
preferred label: borehole imaging @en
related: چاه‌نگاری
scope note: تهیۀ تصویر مستقیم یا غیرمستقیم از دیوارۀ چاه با استفاده از ابزارهای نگاره‌برداری (logging tools) یا روش‌های اپتیکی/ نورشناختی

فن تصویربرداری
type: Concept
narrower: تصویربرداری درون‌چاهی
preferred label: imaging technique @en

چاه‌نگاری
type: Concept
preferred label: well logging @en
related: تصویربرداری درون‌چاهی