تصویربرداری پرتونگاشتی
type: Concept
broader: فن تصویربرداری
preferred label: radiographic imaging @en
scope note: نوعی تصویربرداری براساس تضعیف تفریقی عبور اشعۀ ایکس

فن تصویربرداری
type: Concept
narrower: تصویربرداری پرتونگاشتی
preferred label: imaging technique @en