کشاورزی معیشتی
type: Concept
broader: کشاورزی
preferred label: subsistence agriculture @en
scope note: نوعی کشاورزی که محصولات آن معمولاً تنها برای مصرف خانوادۀ کشاورز کافی است.

کشاورزی
type: Concept
narrower: کشاورزی معیشتی
preferred label: agriculture @en