زبان‌شناسی بالینی
type: Concept
broader: زبان‌شناسی
preferred label: clinical linguistics @en
scope note: کاربرد نظریه‌ها و روش‌های زبان‌شناسی در تحلیل اختلال‌ها و آسیب‌های زبانی

زبان‌شناسی
type: Concept
narrower: زبان‌شناسی بالینی
preferred label: linguistics @en