زبان‌شناسی مقابله‌ای
type: Concept
broader: زبان‌شناسی
preferred label: contrastive linguistics @en
scope note: شاخه‌ای از زبان‌شناسی که وظیفۀ آن تعیین تفاوت‌ها و شباهت‌های زبانی دو زبان در سطوح آوایی و صرفی و نحوی و مانند آنهاست.

زبان‌شناسی
type: Concept
narrower: زبان‌شناسی مقابله‌ای
preferred label: linguistics @en