زبان‌شناسی پیکره‌ای
type: Concept
broader: زبان‌شناسی
preferred label: corpus linguistics @en
scope note: شاخه‌ای از زبان‌شناسی که در آن با ایجاد پایگاه‌های داده‌ای گسترده به بررسی جنبه‌های مختلف زبان می‌پردازد.

زبان‌شناسی
type: Concept
narrower: زبان‌شناسی پیکره‌ای
preferred label: linguistics @en