بوم‌شناسی
type: Concept
preferred label: ecology @en
related: بوم‌زبان‌شناسی

بوم‌زبان‌شناسی
type: Concept
alternative label: زبان‌شناسی بوم‌شناختی
broader: زبان‌شناسی
preferred label: ecolinguistics @en
related: بوم‌شناسی
scope note: رویکردی در زبان‌شناسی که با تأکید بر مفاهیم بوم‌شناختی به مطالعۀ تعامل زبان و محیط فرهنگی می‌پردازد.

زبان‌شناسی
type: Concept
narrower: بوم‌زبان‌شناسی
preferred label: linguistics @en