زبان‌شناسی ریاضی
type: Concept
broader: زبان‌شناسی
preferred label: mathematical linguistics @en
scope note: شاخه‌ای از زبان‌شناسی که با استفاده از مفاهیم آماری و جبری به مطالعۀ ویژگی‌های ریاضی زبان می‌پردازد.

زبان‌شناسی
type: Concept
narrower: زبان‌شناسی ریاضی
preferred label: linguistics @en