زبان‌شناسی نظری
type: Concept
alternative label: زبان‌شناسی همگانی
broader: زبان‌شناسی
preferred label: theoretical linguistics @en
scope note: شاخه‌ای از زبان‌شناسی که به نظریه‌پردازی دربارۀ زبان بشر و قوۀ نطق می‌پردازد.

زبان‌شناسی
type: Concept
narrower: زبان‌شناسی نظری
preferred label: linguistics @en