بازرسی با مایع نافذ
type: Concept
broader: بازرسی
preferred label: liquid-penetrant inspection @en
scope note: نوعی آزمون غیرمخرب برای آشکارسازی ناپیوستگی‌های سطح در آن که با به‌کارگیری مایع نفوذکننده و برداشتن مازاد آن، حفره‌ها و ترک‌ها با استفاده از مواد ظاهرکننده یا بیرون‌کشنده مشخص می‌شوند.

بازرسی
type: Concept
narrower: بازرسی با مایع نافذ
preferred label: inspection @en